{"text_format":"1","workbook":"xlsx","n_sheets":7,"sheets":["S49(2) v.210218","Claim (1)","Claim (2)","Claim (3)","Dates","ABS","Change History"],"not_rendered":{"charts":0,"images":0,"macros":1,"external_links":0,"defined_names":1,"comments":0,"pivot_tables":0},"unopened":[],"bounds":{"document_bytes":16777216,"sheet_cells":100000,"rows_first":2000,"rows_last":500,"rows_between":2000,"halvings":0,"cell_chars":16384,"cell_head_chars":4096},"cells_cut":0,"cells_raw":0,"read":"whole","date_system":"1900"}

{"sheet":"S49(2) v.210218","index":0,"n_rows":43,"n_cols":12,"rows_kept":43,"cut":false,"hidden":false,"merged":[[33,2,33,4],[31,2,31,3],[23,2,23,4],[22,2,22,4],[26,6,28,6],[26,3,28,3],[26,9,28,10],[1,1,1,14],[3,1,5,14],[20,2,20,4],[19,2,19,4],[17,3,17,5],[16,3,16,5]]}
[]
[null,"S.49(2) CALCULATOR  - PREVIOUSLY REDEEMED CLAIMS EFFECT ON CURRENT CLAIMS:"]
[]
[null,"Please note: section 49(2) of the Return to Work Act 2014 was previously known as section 35(5), or section 35(6a) prior to 1 July 2008, of the Workers Rehabilitation and Compensation Act 1986. A reference in any documentation to a worker’s section 35(5) or section 35(6a) figure should, from 1 July 2015, be treated as if it is a reference to a worker’s section 49(2) figure. "]
[]
[]
[]
[null,"INSTRUCTIONS:"]
[null,"1.  Enter worker name & current claim number."]
[null,"2.  Enter either Date of Injury if initial determination, or date of subsequent review. "]
[null,"3.  Enter current claim NWE and any actual weekly earnings."]
[null,"4.  On the claim tab(s), input redeemed claim data."]
[null,"5.  ENTITLEMENT WILL APPEAR IN ROW 'I'."]
[null,"6.  Print a copy of all tabs used and place on current claim file."]
[]
[]
[null,null,"Worker Name:"]
[null,null,"Current Claim No:"]
[]
[null,null,"Date of Injury Current Claim:"]
[null,null,"Date of review Current Claim:"]
[]
[null,null,"Current NWE:"]
[null,null,"Current actual weekly earnings:"]
[]
[]
[null,null,{"$f":"\"Claim (1): \"&'Claim (1)'!D4","v":"Claim (1): "},"Adjusted NWE:",{"$f":"MAX('Claim (1)'!C10,'Claim (1)'!H14:H41)","v":0},null,"Date redemption ceases to take effect from:",{"$f":"IF('Claim (1)'!C8=\"\",\"\",IF('Claim (1)'!C8=\"yes\",\"N/A - SI Claim\",IF('Claim (1)'!C6<42186,42914,'Claim (1)'!C6+728)))","v":""},null,"S49(2) redeemed:    ",null,{"$f":"'Claim (1)'!C11","v":0}]
[null,null,{"$f":"\"Claim (2): \"&'Claim (2)'!D4","v":"Claim (2): "},null,{"$f":"MAX('Claim (2)'!C10,'Claim (2)'!H14:H41)","v":0},null,null,{"$f":"IF('Claim (2)'!C8=\"\",\"\",IF('Claim (2)'!C8=\"yes\",\"N/A - SI Claim\",IF('Claim (2)'!C6<42186,42914,'Claim (2)'!C6+728)))","v":""},null,null,null,{"$f":"'Claim (2)'!C11","v":0}]
[null,null,{"$f":"\"Claim (3): \"&'Claim (3)'!D4","v":"Claim (3): "},null,{"$f":"MAX('Claim (3)'!C10,'Claim (3)'!H14:H41)","v":0},null,null,{"$f":"IF('Claim (3)'!C8=\"\",\"\",IF('Claim (3)'!C8=\"yes\",\"N/A - SI Claim\",IF('Claim (3)'!C6<42186,42914,'Claim (3)'!C6+728)))","v":""},null,null,null,{"$f":"'Claim (3)'!C11","v":0}]
[null,null,null,null,null,null,null,null,null,"S49(2) Total:",null,{"$f":"SUM(L27:L29)","v":0}]
{"$rows_left_out":14}
{"sheet":"Claim (1)","index":1,"n_rows":41,"n_cols":8,"rows_kept":41,"cut":false,"hidden":false,"merged":[[2,3,2,6],[3,3,3,6],[0,0,0,9]]}
["ABS Calculator - Claim 1"]
[]
[null,null,"Worker Name:",{"$f":"IF('S49(2) v.210218'!D17=0,\"\",'S49(2) v.210218'!D17)","v":""}]
[null,null,"Claim No:"]
[]
[null,null,null,"Enter the First Date of Incapacity for the redeemed claim"]
[null,null,null,"Enter the Redemption Payment Date"]
[null,null,null,"Was the worker classified as seriously injured at the time of redemption?"]
[null,null,{"$f":"IF(OR(C6=\"\",C7=\"\"),\"\",IF(MONTH(C7)>MONTH(C6),DATE(YEAR(C7)+1,MONTH(C6),DAY(C6)),IF(AND(MONTH(C7)=MONTH(C6),DAY(C7)>DAY(C6)),DATE(YEAR(C7)+1,MONTH(C6),DAY(C6)),DATE(YEAR(C7),MONTH(C6),DAY(C6)))))","v":""},"The next review date that would have been due on the redeemed claim"]
[null,null,null,"Enter the last NWE figure on the redeemed claim"]
[null,null,null,"Enter the S49(2) figure relevant to the redemption"]
[]
[null,null,"Date S39 (WRCA) or S47 (RTWA) due","NWE ","ABS % Increase","ABS % Increase","Increase","Adjusted NWE "]
[null,null,{"$f":"IF(C8=\"\",\"\",IF(C9=\"\",\"\",IF(AND($C$8=\"No\",Dates!A1>42185),\"\",IF(Dates!A1>MAX('S49(2) v.210218'!$F$20:$F$21),\"\",IF(Dates!A1<=TODAY(),Dates!A1,\"\")))))","v":""},{"$f":"IF(C14=\"\",\"\",C10)","v":""},{"$f":"IF(C14=\"\",\"\",IF(AND($C$8=\"No\",C14>42185),0,F14))","v":""},{"$f":"VLOOKUP(C14,ABS!A:B,2,FALSE)","v":{"$error":"#N/A"}},{"$f":"IF(C14=\"\",\"\",D14*E14%)","v":""},{"$f":"IF(C14=\"\",\"\",G14+D14)","v":""}]
[null,null,{"$f":"IF(C14=\"\",\"\",IF(AND($C$8=\"No\",Dates!A2>42185),\"\",IF(Dates!A2>MAX('S49(2) v.210218'!$F$20:$F$21),\"\",IF(Dates!A2<=TODAY(),Dates!A2,\"\"))))","v":""},{"$f":"IF(C15=\"\",\"\",H14)","v":""},{"$f":"IF(C15=\"\",\"\",IF(AND($C$8=\"No\",C15>42185),0,F15))","v":""},{"$f":"VLOOKUP(C15,ABS!A:B,2,FALSE)","v":{"$error":"#N/A"}},{"$f":"IF(C15=\"\",\"\",D15*E15%)","v":""},{"$f":"IF(C15=\"\",\"\",G15+D15)","v":""}]
[null,null,{"$f":"IF(C15=\"\",\"\",IF(AND($C$8=\"No\",Dates!A3>42185),\"\",IF(Dates!A3>MAX('S49(2) v.210218'!$F$20:$F$21),\"\",IF(Dates!A3<=TODAY(),Dates!A3,\"\"))))","v":""},{"$f":"IF(C16=\"\",\"\",H15)","v":""},"",{"$f":"VLOOKUP(C16,ABS!A:B,2,FALSE)","v":{"$error":"#N/A"}},"",""]
[null,null,{"$f":"IF(C16=\"\",\"\",IF(AND($C$8=\"No\",Dates!A4>42185),\"\",IF(Dates!A4>MAX('S49(2) v.210218'!$F$20:$F$21),\"\",IF(Dates!A4<=TODAY(),Dates!A4,\"\"))))","v":""},"","",{"$f":"VLOOKUP(C17,ABS!A:B,2,FALSE)","v":{"$error":"#N/A"}},"",""]
[null,null,{"$f":"IF(C17=\"\",\"\",IF(AND($C$8=\"No\",Dates!A5>42185),\"\",IF(Dates!A5>MAX('S49(2) v.210218'!$F$20:$F$21),\"\",IF(Dates!A5<=TODAY(),Dates!A5,\"\"))))","v":""},"","",{"$f":"VLOOKUP(C18,ABS!A:B,2,FALSE)","v":{"$error":"#N/A"}},"",""]
[null,null,{"$f":"IF(C18=\"\",\"\",IF(AND($C$8=\"No\",Dates!A6>42185),\"\",IF(Dates!A6>MAX('S49(2) v.210218'!$F$20:$F$21),\"\",IF(Dates!A6<=TODAY(),Dates!A6,\"\"))))","v":""},"","",{"$f":"VLOOKUP(C19,ABS!A:B,2,FALSE)","v":{"$error":"#N/A"}},"",""]
[null,null,{"$f":"IF(C19=\"\",\"\",IF(AND($C$8=\"No\",Dates!A7>42185),\"\",IF(Dates!A7>MAX('S49(2) v.210218'!$F$20:$F$21),\"\",IF(Dates!A7<=TODAY(),Dates!A7,\"\"))))","v":""},"","",{"$f":"VLOOKUP(C20,ABS!A:B,2,FALSE)","v":{"$error":"#N/A"}},"",""]
[null,null,{"$f":"IF(C20=\"\",\"\",IF(AND($C$8=\"No\",Dates!A8>42185),\"\",IF(Dates!A8>MAX('S49(2) v.210218'!$F$20:$F$21),\"\",IF(Dates!A8<=TODAY(),Dates!A8,\"\"))))","v":""},"","",{"$f":"VLOOKUP(C21,ABS!A:B,2,FALSE)","v":{"$error":"#N/A"}},"",{"$f":"IF(C21=\"\",\"\",G21+D21)","v":""}]
[null,null,{"$f":"IF(C21=\"\",\"\",IF(AND($C$8=\"No\",Dates!A9>42185),\"\",IF(Dates!A9>MAX('S49(2) v.210218'!$F$20:$F$21),\"\",IF(Dates!A9<=TODAY(),Dates!A9,\"\"))))","v":""},"","",{"$f":"VLOOKUP(C22,ABS!A:B,2,FALSE)","v":{"$error":"#N/A"}},"",""]
[null,null,{"$f":"IF(C22=\"\",\"\",IF(AND($C$8=\"No\",Dates!A10>42185),\"\",IF(Dates!A10>MAX('S49(2) v.210218'!$F$20:$F$21),\"\",IF(Dates!A10<=TODAY(),Dates!A10,\"\"))))","v":""},{"$f":"IF(C23=\"\",\"\",H22)","v":""},"",{"$f":"VLOOKUP(C23,ABS!A:B,2,FALSE)","v":{"$error":"#N/A"}},"",""]
[null,null,{"$f":"IF(C23=\"\",\"\",IF(AND($C$8=\"No\",Dates!A11>42185),\"\",IF(Dates!A11>MAX('S49(2) v.210218'!$F$20:$F$21),\"\",IF(Dates!A11<=TODAY(),Dates!A11,\"\"))))","v":""},"","",{"$f":"VLOOKUP(C24,ABS!A:B,2,FALSE)","v":{"$error":"#N/A"}},{"$f":"IF(C24=\"\",\"\",D24*E24%)","v":""},""]
[null,null,{"$f":"IF(C24=\"\",\"\",IF(AND($C$8=\"No\",Dates!A12>42185),\"\",IF(Dates!A12>MAX('S49(2) v.210218'!$F$20:$F$21),\"\",IF(Dates!A12<=TODAY(),Dates!A12,\"\"))))","v":""},"","",{"$f":"VLOOKUP(C25,ABS!A:B,2,FALSE)","v":{"$error":"#N/A"}},"",""]
[null,null,{"$f":"IF(C25=\"\",\"\",IF(AND($C$8=\"No\",Dates!A13>42185),\"\",IF(Dates!A13>MAX('S49(2) v.210218'!$F$20:$F$21),\"\",IF(Dates!A13<=TODAY(),Dates!A13,\"\"))))","v":""},"","",{"$f":"VLOOKUP(C26,ABS!A:B,2,FALSE)","v":{"$error":"#N/A"}},"",""]
[null,null,{"$f":"IF(C26=\"\",\"\",IF(AND($C$8=\"No\",Dates!A14>42185),\"\",IF(Dates!A14>MAX('S49(2) v.210218'!$F$20:$F$21),\"\",IF(Dates!A14<=TODAY(),Dates!A14,\"\"))))","v":""},"","",{"$f":"VLOOKUP(C27,ABS!A:B,2,FALSE)","v":{"$error":"#N/A"}},"",{"$f":"IF(C27=\"\",\"\",G27+D27)","v":""}]
[null,null,{"$f":"IF(C27=\"\",\"\",IF(AND($C$8=\"No\",Dates!A15>42185),\"\",IF(Dates!A15>MAX('S49(2) v.210218'!$F$20:$F$21),\"\",IF(Dates!A15<=TODAY(),Dates!A15,\"\"))))","v":""},{"$f":"IF(C28=\"\",\"\",H27)","v":""},"",{"$f":"VLOOKUP(C28,ABS!A:B,2,FALSE)","v":{"$error":"#N/A"}},"",""]
[null,null,{"$f":"IF(C28=\"\",\"\",IF(AND($C$8=\"No\",Dates!A16>42185),\"\",IF(Dates!A16>MAX('S49(2) v.210218'!$F$20:$F$21),\"\",IF(Dates!A16<=TODAY(),Dates!A16,\"\"))))","v":""},"","",{"$f":"VLOOKUP(C29,ABS!A:B,2,FALSE)","v":{"$error":"#N/A"}},"",""]
[null,null,{"$f":"IF(C29=\"\",\"\",IF(AND($C$8=\"No\",Dates!A17>42185),\"\",IF(Dates!A17>MAX('S49(2) v.210218'!$F$20:$F$21),\"\",IF(Dates!A17<=TODAY(),Dates!A17,\"\"))))","v":""},"","",{"$f":"VLOOKUP(C30,ABS!A:B,2,FALSE)","v":{"$error":"#N/A"}},{"$f":"IF(C30=\"\",\"\",D30*E30%)","v":""},""]
{"$rows_left_out":12}
{"sheet":"Claim (2)","index":2,"n_rows":41,"n_cols":8,"rows_kept":41,"cut":false,"hidden":false,"merged":[[2,3,2,6],[3,3,3,6],[0,0,0,9]]}
["ABS Calculator - Claim 2"]
[]
[null,null,"Worker Name:",{"$f":"IF('S49(2) v.210218'!D17=0,\"\",'S49(2) v.210218'!D17)","v":""}]
[null,null,"Claim No:"]
[]
[null,null,null,"Enter the First Date of Incapacity for the redeemed claim"]
[null,null,null,"Enter the Redemption Payment Date"]
[null,null,null,"Was the worker classified as seriously injured at the time of redemption?"]
[null,null,{"$f":"IF(OR(C6=\"\",C7=\"\"),\"\",IF(MONTH(C7)>MONTH(C6),DATE(YEAR(C7)+1,MONTH(C6),DAY(C6)),IF(AND(MONTH(C7)=MONTH(C6),DAY(C7)>DAY(C6)),DATE(YEAR(C7)+1,MONTH(C6),DAY(C6)),DATE(YEAR(C7),MONTH(C6),DAY(C6)))))","v":""},"The next review date that would have been due on the redeemed claim"]
[null,null,null,"Enter the last NWE figure on the redeemed claim"]
[null,null,null,"Enter the S49(2) figure relevant to the redemption"]
[]
[null,null,"Date S39 (WRCA) or S47 (RTWA) due","NWE ","ABS % Increase","ABS % Increase","Increase","Adjusted NWE "]
[null,null,{"$f":"IF(C8=\"\",\"\",IF(C9=\"\",\"\",IF(AND($C$8=\"No\",Dates!A1>42185),\"\",IF(Dates!A1>MAX('S49(2) v.210218'!$F$20:$F$21),\"\",IF(Dates!A1<=TODAY(),Dates!A1,\"\")))))","v":""},{"$f":"IF(C14=\"\",\"\",C10)","v":""},{"$f":"IF(C14=\"\",\"\",IF(AND($C$8=\"No\",C14>42185),0,F14))","v":""},{"$f":"VLOOKUP(C14,ABS!A:B,2,FALSE)","v":{"$error":"#N/A"}},{"$f":"IF(C14=\"\",\"\",D14*E14%)","v":""},{"$f":"IF(C14=\"\",\"\",G14+D14)","v":""}]
[null,null,{"$f":"IF(C14=\"\",\"\",IF(AND($C$8=\"No\",Dates!A2>42185),\"\",IF(Dates!A2>MAX('S49(2) v.210218'!$F$20:$F$21),\"\",IF(Dates!A2<=TODAY(),Dates!A2,\"\"))))","v":""},{"$f":"IF(C15=\"\",\"\",H14)","v":""},{"$f":"IF(C15=\"\",\"\",IF(AND($C$8=\"No\",C15>42185),0,F15))","v":""},{"$f":"VLOOKUP(C15,ABS!A:B,2,FALSE)","v":{"$error":"#N/A"}},{"$f":"IF(C15=\"\",\"\",D15*E15%)","v":""},{"$f":"IF(C15=\"\",\"\",G15+D15)","v":""}]
[null,null,{"$f":"IF(C15=\"\",\"\",IF(AND($C$8=\"No\",Dates!A3>42185),\"\",IF(Dates!A3>MAX('S49(2) v.210218'!$F$20:$F$21),\"\",IF(Dates!A3<=TODAY(),Dates!A3,\"\"))))","v":""},{"$f":"IF(C16=\"\",\"\",H15)","v":""},"",{"$f":"VLOOKUP(C16,ABS!A:B,2,FALSE)","v":{"$error":"#N/A"}},"",""]
[null,null,{"$f":"IF(C16=\"\",\"\",IF(AND($C$8=\"No\",Dates!A4>42185),\"\",IF(Dates!A4>MAX('S49(2) v.210218'!$F$20:$F$21),\"\",IF(Dates!A4<=TODAY(),Dates!A4,\"\"))))","v":""},"","",{"$f":"VLOOKUP(C17,ABS!A:B,2,FALSE)","v":{"$error":"#N/A"}},"",""]
[null,null,{"$f":"IF(C17=\"\",\"\",IF(AND($C$8=\"No\",Dates!A5>42185),\"\",IF(Dates!A5>MAX('S49(2) v.210218'!$F$20:$F$21),\"\",IF(Dates!A5<=TODAY(),Dates!A5,\"\"))))","v":""},"","",{"$f":"VLOOKUP(C18,ABS!A:B,2,FALSE)","v":{"$error":"#N/A"}},"",""]
[null,null,{"$f":"IF(C18=\"\",\"\",IF(AND($C$8=\"No\",Dates!A6>42185),\"\",IF(Dates!A6>MAX('S49(2) v.210218'!$F$20:$F$21),\"\",IF(Dates!A6<=TODAY(),Dates!A6,\"\"))))","v":""},"","",{"$f":"VLOOKUP(C19,ABS!A:B,2,FALSE)","v":{"$error":"#N/A"}},"",""]
[null,null,{"$f":"IF(C19=\"\",\"\",IF(AND($C$8=\"No\",Dates!A7>42185),\"\",IF(Dates!A7>MAX('S49(2) v.210218'!$F$20:$F$21),\"\",IF(Dates!A7<=TODAY(),Dates!A7,\"\"))))","v":""},"","",{"$f":"VLOOKUP(C20,ABS!A:B,2,FALSE)","v":{"$error":"#N/A"}},"",""]
[null,null,{"$f":"IF(C20=\"\",\"\",IF(AND($C$8=\"No\",Dates!A8>42185),\"\",IF(Dates!A8>MAX('S49(2) v.210218'!$F$20:$F$21),\"\",IF(Dates!A8<=TODAY(),Dates!A8,\"\"))))","v":""},"","",{"$f":"VLOOKUP(C21,ABS!A:B,2,FALSE)","v":{"$error":"#N/A"}},"",{"$f":"IF(C21=\"\",\"\",G21+D21)","v":""}]
[null,null,{"$f":"IF(C21=\"\",\"\",IF(AND($C$8=\"No\",Dates!A9>42185),\"\",IF(Dates!A9>MAX('S49(2) v.210218'!$F$20:$F$21),\"\",IF(Dates!A9<=TODAY(),Dates!A9,\"\"))))","v":""},"","",{"$f":"VLOOKUP(C22,ABS!A:B,2,FALSE)","v":{"$error":"#N/A"}},"",""]
[null,null,{"$f":"IF(C22=\"\",\"\",IF(AND($C$8=\"No\",Dates!A10>42185),\"\",IF(Dates!A10>MAX('S49(2) v.210218'!$F$20:$F$21),\"\",IF(Dates!A10<=TODAY(),Dates!A10,\"\"))))","v":""},{"$f":"IF(C23=\"\",\"\",H22)","v":""},"",{"$f":"VLOOKUP(C23,ABS!A:B,2,FALSE)","v":{"$error":"#N/A"}},"",""]
[null,null,{"$f":"IF(C23=\"\",\"\",IF(AND($C$8=\"No\",Dates!A11>42185),\"\",IF(Dates!A11>MAX('S49(2) v.210218'!$F$20:$F$21),\"\",IF(Dates!A11<=TODAY(),Dates!A11,\"\"))))","v":""},"","",{"$f":"VLOOKUP(C24,ABS!A:B,2,FALSE)","v":{"$error":"#N/A"}},{"$f":"IF(C24=\"\",\"\",D24*E24%)","v":""},""]
[null,null,{"$f":"IF(C24=\"\",\"\",IF(AND($C$8=\"No\",Dates!A12>42185),\"\",IF(Dates!A12>MAX('S49(2) v.210218'!$F$20:$F$21),\"\",IF(Dates!A12<=TODAY(),Dates!A12,\"\"))))","v":""},"","",{"$f":"VLOOKUP(C25,ABS!A:B,2,FALSE)","v":{"$error":"#N/A"}},"",""]
[null,null,{"$f":"IF(C25=\"\",\"\",IF(AND($C$8=\"No\",Dates!A13>42185),\"\",IF(Dates!A13>MAX('S49(2) v.210218'!$F$20:$F$21),\"\",IF(Dates!A13<=TODAY(),Dates!A13,\"\"))))","v":""},"","",{"$f":"VLOOKUP(C26,ABS!A:B,2,FALSE)","v":{"$error":"#N/A"}},"",""]
[null,null,{"$f":"IF(C26=\"\",\"\",IF(AND($C$8=\"No\",Dates!A14>42185),\"\",IF(Dates!A14>MAX('S49(2) v.210218'!$F$20:$F$21),\"\",IF(Dates!A14<=TODAY(),Dates!A14,\"\"))))","v":""},"","",{"$f":"VLOOKUP(C27,ABS!A:B,2,FALSE)","v":{"$error":"#N/A"}},"",{"$f":"IF(C27=\"\",\"\",G27+D27)","v":""}]
[null,null,{"$f":"IF(C27=\"\",\"\",IF(AND($C$8=\"No\",Dates!A15>42185),\"\",IF(Dates!A15>MAX('S49(2) v.210218'!$F$20:$F$21),\"\",IF(Dates!A15<=TODAY(),Dates!A15,\"\"))))","v":""},{"$f":"IF(C28=\"\",\"\",H27)","v":""},"",{"$f":"VLOOKUP(C28,ABS!A:B,2,FALSE)","v":{"$error":"#N/A"}},"",""]
[null,null,{"$f":"IF(C28=\"\",\"\",IF(AND($C$8=\"No\",Dates!A16>42185),\"\",IF(Dates!A16>MAX('S49(2) v.210218'!$F$20:$F$21),\"\",IF(Dates!A16<=TODAY(),Dates!A16,\"\"))))","v":""},"","",{"$f":"VLOOKUP(C29,ABS!A:B,2,FALSE)","v":{"$error":"#N/A"}},"",""]
[null,null,{"$f":"IF(C29=\"\",\"\",IF(AND($C$8=\"No\",Dates!A17>42185),\"\",IF(Dates!A17>MAX('S49(2) v.210218'!$F$20:$F$21),\"\",IF(Dates!A17<=TODAY(),Dates!A17,\"\"))))","v":""},"","",{"$f":"VLOOKUP(C30,ABS!A:B,2,FALSE)","v":{"$error":"#N/A"}},{"$f":"IF(C30=\"\",\"\",D30*E30%)","v":""},""]
{"$rows_left_out":12}
{"sheet":"Claim (3)","index":3,"n_rows":41,"n_cols":8,"rows_kept":41,"cut":false,"hidden":false,"merged":[[2,3,2,6],[3,3,3,6],[0,0,0,9]]}
["ABS Calculator - Claim 3"]
[]
[null,null,"Worker Name:",{"$f":"IF('S49(2) v.210218'!D17=0,\"\",'S49(2) v.210218'!D17)","v":""}]
[null,null,"Claim No:"]
[]
[null,null,null,"Enter the First Date of Incapacity for the redeemed claim"]
[null,null,null,"Enter the Redemption Payment Date"]
[null,null,null,"Was the worker classified as seriously injured at the time of redemption?"]
[null,null,{"$f":"IF(OR(C6=\"\",C7=\"\"),\"\",IF(MONTH(C7)>MONTH(C6),DATE(YEAR(C7)+1,MONTH(C6),DAY(C6)),IF(AND(MONTH(C7)=MONTH(C6),DAY(C7)>DAY(C6)),DATE(YEAR(C7)+1,MONTH(C6),DAY(C6)),DATE(YEAR(C7),MONTH(C6),DAY(C6)))))","v":""},"The next review date that would have been due on the redeemed claim"]
[null,null,null,"Enter the last NWE figure on the redeemed claim"]
[null,null,null,"Enter the S49(2) figure relevant to the redemption"]
[]
[null,null,"Date S39 (WRCA) or S47 (RTWA) due","NWE ","ABS % Increase","ABS % Increase","Increase","Adjusted NWE "]
[null,null,{"$f":"IF(C8=\"\",\"\",IF(C9=\"\",\"\",IF(AND($C$8=\"No\",Dates!A1>42185),\"\",IF(Dates!A1>MAX('S49(2) v.210218'!$F$20:$F$21),\"\",IF(Dates!A1<=TODAY(),Dates!A1,\"\")))))","v":""},{"$f":"IF(C14=\"\",\"\",C10)","v":""},{"$f":"IF(C14=\"\",\"\",IF(AND($C$8=\"No\",C14>42185),0,F14))","v":""},{"$f":"VLOOKUP(C14,ABS!A:B,2,FALSE)","v":{"$error":"#N/A"}},{"$f":"IF(C14=\"\",\"\",D14*E14%)","v":""},{"$f":"IF(C14=\"\",\"\",G14+D14)","v":""}]
[null,null,{"$f":"IF(C14=\"\",\"\",IF(AND($C$8=\"No\",Dates!A2>42185),\"\",IF(Dates!A2>MAX('S49(2) v.210218'!$F$20:$F$21),\"\",IF(Dates!A2<=TODAY(),Dates!A2,\"\"))))","v":""},{"$f":"IF(C15=\"\",\"\",H14)","v":""},{"$f":"IF(C15=\"\",\"\",IF(AND($C$8=\"No\",C15>42185),0,F15))","v":""},{"$f":"VLOOKUP(C15,ABS!A:B,2,FALSE)","v":{"$error":"#N/A"}},{"$f":"IF(C15=\"\",\"\",D15*E15%)","v":""},{"$f":"IF(C15=\"\",\"\",G15+D15)","v":""}]
[null,null,{"$f":"IF(C15=\"\",\"\",IF(AND($C$8=\"No\",Dates!A3>42185),\"\",IF(Dates!A3>MAX('S49(2) v.210218'!$F$20:$F$21),\"\",IF(Dates!A3<=TODAY(),Dates!A3,\"\"))))","v":""},{"$f":"IF(C16=\"\",\"\",H15)","v":""},"",{"$f":"VLOOKUP(C16,ABS!A:B,2,FALSE)","v":{"$error":"#N/A"}},"",""]
[null,null,{"$f":"IF(C16=\"\",\"\",IF(AND($C$8=\"No\",Dates!A4>42185),\"\",IF(Dates!A4>MAX('S49(2) v.210218'!$F$20:$F$21),\"\",IF(Dates!A4<=TODAY(),Dates!A4,\"\"))))","v":""},"","",{"$f":"VLOOKUP(C17,ABS!A:B,2,FALSE)","v":{"$error":"#N/A"}},"",""]
[null,null,{"$f":"IF(C17=\"\",\"\",IF(AND($C$8=\"No\",Dates!A5>42185),\"\",IF(Dates!A5>MAX('S49(2) v.210218'!$F$20:$F$21),\"\",IF(Dates!A5<=TODAY(),Dates!A5,\"\"))))","v":""},"","",{"$f":"VLOOKUP(C18,ABS!A:B,2,FALSE)","v":{"$error":"#N/A"}},"",""]
[null,null,{"$f":"IF(C18=\"\",\"\",IF(AND($C$8=\"No\",Dates!A6>42185),\"\",IF(Dates!A6>MAX('S49(2) v.210218'!$F$20:$F$21),\"\",IF(Dates!A6<=TODAY(),Dates!A6,\"\"))))","v":""},"","",{"$f":"VLOOKUP(C19,ABS!A:B,2,FALSE)","v":{"$error":"#N/A"}},"",""]
[null,null,{"$f":"IF(C19=\"\",\"\",IF(AND($C$8=\"No\",Dates!A7>42185),\"\",IF(Dates!A7>MAX('S49(2) v.210218'!$F$20:$F$21),\"\",IF(Dates!A7<=TODAY(),Dates!A7,\"\"))))","v":""},"","",{"$f":"VLOOKUP(C20,ABS!A:B,2,FALSE)","v":{"$error":"#N/A"}},"",""]
[null,null,{"$f":"IF(C20=\"\",\"\",IF(AND($C$8=\"No\",Dates!A8>42185),\"\",IF(Dates!A8>MAX('S49(2) v.210218'!$F$20:$F$21),\"\",IF(Dates!A8<=TODAY(),Dates!A8,\"\"))))","v":""},"","",{"$f":"VLOOKUP(C21,ABS!A:B,2,FALSE)","v":{"$error":"#N/A"}},"",{"$f":"IF(C21=\"\",\"\",G21+D21)","v":""}]
[null,null,{"$f":"IF(C21=\"\",\"\",IF(AND($C$8=\"No\",Dates!A9>42185),\"\",IF(Dates!A9>MAX('S49(2) v.210218'!$F$20:$F$21),\"\",IF(Dates!A9<=TODAY(),Dates!A9,\"\"))))","v":""},"","",{"$f":"VLOOKUP(C22,ABS!A:B,2,FALSE)","v":{"$error":"#N/A"}},"",""]
[null,null,{"$f":"IF(C22=\"\",\"\",IF(AND($C$8=\"No\",Dates!A10>42185),\"\",IF(Dates!A10>MAX('S49(2) v.210218'!$F$20:$F$21),\"\",IF(Dates!A10<=TODAY(),Dates!A10,\"\"))))","v":""},{"$f":"IF(C23=\"\",\"\",H22)","v":""},"",{"$f":"VLOOKUP(C23,ABS!A:B,2,FALSE)","v":{"$error":"#N/A"}},"",""]
[null,null,{"$f":"IF(C23=\"\",\"\",IF(AND($C$8=\"No\",Dates!A11>42185),\"\",IF(Dates!A11>MAX('S49(2) v.210218'!$F$20:$F$21),\"\",IF(Dates!A11<=TODAY(),Dates!A11,\"\"))))","v":""},"","",{"$f":"VLOOKUP(C24,ABS!A:B,2,FALSE)","v":{"$error":"#N/A"}},{"$f":"IF(C24=\"\",\"\",D24*E24%)","v":""},""]
[null,null,{"$f":"IF(C24=\"\",\"\",IF(AND($C$8=\"No\",Dates!A12>42185),\"\",IF(Dates!A12>MAX('S49(2) v.210218'!$F$20:$F$21),\"\",IF(Dates!A12<=TODAY(),Dates!A12,\"\"))))","v":""},"","",{"$f":"VLOOKUP(C25,ABS!A:B,2,FALSE)","v":{"$error":"#N/A"}},"",""]
[null,null,{"$f":"IF(C25=\"\",\"\",IF(AND($C$8=\"No\",Dates!A13>42185),\"\",IF(Dates!A13>MAX('S49(2) v.210218'!$F$20:$F$21),\"\",IF(Dates!A13<=TODAY(),Dates!A13,\"\"))))","v":""},"","",{"$f":"VLOOKUP(C26,ABS!A:B,2,FALSE)","v":{"$error":"#N/A"}},"",""]
[null,null,{"$f":"IF(C26=\"\",\"\",IF(AND($C$8=\"No\",Dates!A14>42185),\"\",IF(Dates!A14>MAX('S49(2) v.210218'!$F$20:$F$21),\"\",IF(Dates!A14<=TODAY(),Dates!A14,\"\"))))","v":""},"","",{"$f":"VLOOKUP(C27,ABS!A:B,2,FALSE)","v":{"$error":"#N/A"}},"",{"$f":"IF(C27=\"\",\"\",G27+D27)","v":""}]
[null,null,{"$f":"IF(C27=\"\",\"\",IF(AND($C$8=\"No\",Dates!A15>42185),\"\",IF(Dates!A15>MAX('S49(2) v.210218'!$F$20:$F$21),\"\",IF(Dates!A15<=TODAY(),Dates!A15,\"\"))))","v":""},{"$f":"IF(C28=\"\",\"\",H27)","v":""},"",{"$f":"VLOOKUP(C28,ABS!A:B,2,FALSE)","v":{"$error":"#N/A"}},"",""]
[null,null,{"$f":"IF(C28=\"\",\"\",IF(AND($C$8=\"No\",Dates!A16>42185),\"\",IF(Dates!A16>MAX('S49(2) v.210218'!$F$20:$F$21),\"\",IF(Dates!A16<=TODAY(),Dates!A16,\"\"))))","v":""},"","",{"$f":"VLOOKUP(C29,ABS!A:B,2,FALSE)","v":{"$error":"#N/A"}},"",""]
[null,null,{"$f":"IF(C29=\"\",\"\",IF(AND($C$8=\"No\",Dates!A17>42185),\"\",IF(Dates!A17>MAX('S49(2) v.210218'!$F$20:$F$21),\"\",IF(Dates!A17<=TODAY(),Dates!A17,\"\"))))","v":""},"","",{"$f":"VLOOKUP(C30,ABS!A:B,2,FALSE)","v":{"$error":"#N/A"}},{"$f":"IF(C30=\"\",\"\",D30*E30%)","v":""},""]
{"$rows_left_out":12}
{"sheet":"Dates","index":4,"n_rows":28,"n_cols":3,"rows_kept":28,"cut":false,"hidden":true,"merged":[]}
[{"$f":"+'Claim (1)'!C9","v":""},{"$f":"+'Claim (2)'!C8","v":"00:00:00"},{"$f":"+'Claim (3)'!C8","v":"00:00:00"}]
[{"$f":"DATE(YEAR(A1)+1,MONTH(A1),DAY(A1))","v":{"$error":"#VALUE!"}},{"$f":"DATE(YEAR(B1)+1,MONTH(B1),DAY(B1))","v":"1900-12-31"},{"$f":"DATE(YEAR(C1)+1,MONTH(C1),DAY(C1))","v":"1900-12-31"}]
[{"$f":"DATE(YEAR(A2)+1,MONTH(A2),DAY(A2))","v":{"$error":"#VALUE!"}},"1901-12-31",{"$f":"DATE(YEAR(C2)+1,MONTH(C2),DAY(C2))","v":"1901-12-31"}]
[{"$error":"#VALUE!"},"1902-12-31","1902-12-31"]
[{"$error":"#VALUE!"},"1903-12-31","1903-12-31"]
[{"$error":"#VALUE!"},"1904-12-31","1904-12-31"]
[{"$error":"#VALUE!"},"1905-12-31","1905-12-31"]
[{"$error":"#VALUE!"},"1906-12-31","1906-12-31"]
[{"$error":"#VALUE!"},"1907-12-31","1907-12-31"]
[{"$error":"#VALUE!"},"1908-12-31","1908-12-31"]
[{"$error":"#VALUE!"},"1909-12-31","1909-12-31"]
[{"$error":"#VALUE!"},"1910-12-31","1910-12-31"]
[{"$error":"#VALUE!"},"1911-12-31","1911-12-31"]
[{"$error":"#VALUE!"},"1912-12-31","1912-12-31"]
[{"$error":"#VALUE!"},"1913-12-31","1913-12-31"]
[{"$error":"#VALUE!"},"1914-12-31","1914-12-31"]
[{"$error":"#VALUE!"},"1915-12-31","1915-12-31"]
[{"$error":"#VALUE!"},"1916-12-31","1916-12-31"]
[{"$error":"#VALUE!"},"1917-12-31","1917-12-31"]
[{"$error":"#VALUE!"},"1918-12-31","1918-12-31"]
[{"$error":"#VALUE!"},"1919-12-31","1919-12-31"]
[{"$error":"#VALUE!"},"1920-12-31","1920-12-31"]
[{"$error":"#VALUE!"},"1921-12-31","1921-12-31"]
[{"$error":"#VALUE!"},"1922-12-31","1922-12-31"]
[{"$error":"#VALUE!"},"1923-12-31","1923-12-31"]
[{"$error":"#VALUE!"},"1924-12-31","1924-12-31"]
[{"$error":"#VALUE!"},"1925-12-31","1925-12-31"]
[{"$error":"#VALUE!"},"1926-12-31","1926-12-31"]

{"sheet":"ABS","index":5,"n_rows":11626,"n_cols":2,"rows_kept":11626,"cut":false,"hidden":true,"merged":[]}
["1987-09-01"]
["1987-09-02"]
["1987-09-03"]
["1987-09-04"]
["1987-09-05"]
["1987-09-06"]
["1987-09-07"]
["1987-09-08"]
["1987-09-09"]
["1987-09-10"]
["1987-09-11"]
["1987-09-12"]
["1987-09-13"]
["1987-09-14"]
["1987-09-15"]
["1987-09-16"]
["1987-09-17"]
["1987-09-18"]
["1987-09-19"]
["1987-09-20"]
["1987-09-21"]
["1987-09-22"]
["1987-09-23"]
["1987-09-24"]
["1987-09-25"]
["1987-09-26"]
["1987-09-27"]
["1987-09-28"]
["1987-09-29"]
["1987-09-30"]
{"$rows_left_out":11597}
{"sheet":"Change History","index":6,"n_rows":17,"n_cols":4,"rows_kept":17,"cut":false,"hidden":true,"merged":[]}
["Date","Name","Log No.","Comments"]
[]
["2013-08-14","NNM",123022,"ABS rate has stayed the same at 3.3%"]
["2013-11-13","NNM",11420,"ABS rate was changed to 3.4%"]
["2014-02-19","NNM",11809,"ABS rate was increased to 3.5%"]
["2014-05-21","NNM",4185,"ABS rate was reduced to 3.2%"]
["2014-08-13","NNM",8764,"ABS rate was reduced to 3.1%"]
["2014-11-12","NNM",15140,"ABS rate was reduced to 2.7%"]
["2015-02-25","NNM",21309,"ABS rate was reduced to 2.6%"]
["2015-04-08","SH",13512,"Calculator updated for changes wef 01/07/2015 & new password added to be consistent across all sheets, workbooks and other calculators"]
["2015-05-13","SH",null,"ABS rate was reduced to 2.5%"]
["2015-11-18","SH",null,"ABS rate was reduced to 2.3%"]
["2017-02-23","SH",null,"ABS rate was reduced to 2.2% wef 22/02/2017"]
["2017-06-26","SH",84980,"Calculator updated as per versa case 84980, to cover whether worker was seriously injued on a prior redeemed claim."]
["2017-08-17","SH",null,"ABS rate was reduced to 2.1% wef 16/08/2017"]
["2017-11-16","SH",null,"ABS rate was reduced to 2.0% wef 15/11/2017"]
["2018-02-21","SH",115518,"ABS rate was reduced to 1.9% wef 21/02/2018"]